Reaction Details
TargetSomatostatin receptor type 2
LigandBDBM84638
Substrate/Competitorn/a
Ki 7.8±n/a nM
CommentsPDSP_397
Citation Raynor, KMurphy, WACoy, DHTaylor, JEMoreau, JPYasuda, KBell, GIReisine, T Cloned somatostatin receptors: identification of subtype-selective peptides and demonstration of high affinity binding of linear peptides. Mol Pharmacol43:838-44 (1993) Somatostatin receptor type 2
Name:Somatostatin receptor type 2
Type:Enzyme Catalytic Domain
Mol. Mass.:41234.26
Organism:MOUSE
Description:SOMATOSTATIN SST2 SSTR2 MOUSE::P30875
Residue:369
BDBM84638
NameBDBM84638
Synonyms:BIM 23070
TypeSmall organic molecule
Emp. Form.C58H71N11O10
Mol. Mass.1082.252
SMILESCC(O)[C@H](NC(=O)[C@H](CCCCN)NC(=O)[C@@H](Cc1c[nH]c2ccccc12)NC(=O)[C@H](Cc1ccc(O)cc1)NC(=O)[C@H](C)NC(=O)[C@H](N)Cc1ccccc1)C(=O)N[C@@H](C)C(=O)N[C@@H](Cc1cccc2ccccc12)C(N)=O