Reaction Details
TargetSomatostatin receptor type 2
LigandBDBM84628
Substrate/Competitorn/a
Ki 4.8±n/a nM
CommentsPDSP_775
Citation Raynor, KMurphy, WACoy, DHTaylor, JEMoreau, JPYasuda, KBell, GIReisine, T Cloned somatostatin receptors: identification of subtype-selective peptides and demonstration of high affinity binding of linear peptides. Mol Pharmacol43:838-44 (1993) Somatostatin receptor type 2
Name:Somatostatin receptor type 2
Type:Enzyme Catalytic Domain
Mol. Mass.:41234.26
Organism:MOUSE
Description:SOMATOSTATIN SST2 SSTR2 MOUSE::P30875
Residue:369
BDBM84628
NameBDBM84628
Synonyms:EC5-21
TypeSmall organic molecule
Emp. Form.C56H66N10O8S2
Mol. Mass.1071.315
SMILESCC(O)C1NC(=O)C(CCCCN)NC(=O)C(Cc2c[nH]c3ccccc23)NC(=O)C(Cc2ccccc2)NC(=O)C(CSSCC(NC1=O)C(=O)NCc1cccc2ccccc12)NC(=O)C(N)Cc1ccccc1