Reaction Details
TargetSomatostatin receptor type 3
LigandBDBM82469
Substrate/Competitorn/a
Ki 2.1±n/a nM
CommentsPDSP_372
Citation Raynor, KMurphy, WACoy, DHTaylor, JEMoreau, JPYasuda, KBell, GIReisine, T Cloned somatostatin receptors: identification of subtype-selective peptides and demonstration of high affinity binding of linear peptides. Mol Pharmacol43:838-44 (1993) Somatostatin receptor type 3
Name:Somatostatin receptor type 3
Type:Enzyme Catalytic Domain
Mol. Mass.:47225.49
Organism:MOUSE
Description:SOMATOSTATIN SST3 SSTR3 MOUSE::P30935
Residue:428
BDBM82469
NameBDBM82469
Synonyms:BIM 23003 EC5-21 | L-Cys(1)-L-Lys-L-Asn-4-Chloro-L-Phe-L-Phe-D-Trp-L-Lys-L-Thr-L-Phe-L-Thr-L-Ser-L-Cys(1)-OH
TypeSmall organic molecule
Emp. Form.C71H95ClN16O17S2
Mol. Mass.1544.194
SMILESC[C@@H](O)[C@@H]1NC(=O)[C@H](CCCCN)NC(=O)[C@@H](Cc2c[nH]c3ccccc23)NC(=O)[C@H](Cc2ccccc2)NC(=O)[C@H](Cc2ccc(Cl)cc2)NC(=O)[C@H](CC(N)=O)NC(=O)[C@H](CCCCN)NC(=O)[C@@H](N)CSSC[C@H](NC(=O)[C@H](CO)NC(=O)[C@@H](NC(=O)[C@H](Cc2ccccc2)NC1=O)[C@@H](C)O)C(O)=O