Reaction Details
TargetSomatostatin receptor type 3
LigandBDBM82458
Substrate/Competitorn/a
Ki 10±n/a nM
CommentsPDSP_379
Citation Raynor, KMurphy, WACoy, DHTaylor, JEMoreau, JPYasuda, KBell, GIReisine, T Cloned somatostatin receptors: identification of subtype-selective peptides and demonstration of high affinity binding of linear peptides. Mol Pharmacol43:838-44 (1993) Somatostatin receptor type 3
Name:Somatostatin receptor type 3
Type:Enzyme Catalytic Domain
Mol. Mass.:47225.49
Organism:MOUSE
Description:SOMATOSTATIN SST3 SSTR3 MOUSE::P30935
Residue:428
BDBM82458
NameBDBM82458
Synonyms:BIM 23049 | D-Nal-Ala-Tyr-D-Trp-Lys-Val-Ala-Thr-NH2
TypeSmall organic molecule
Emp. Form.C52H68N10O9
Mol. Mass.977.1579
SMILESCC(C)[C@H](NC(=O)[C@H](CCCCN)NC(=O)[C@@H](Cc1c[nH]c2ccccc12)NC(=O)[C@H](Cc1ccc(O)cc1)NC(=O)[C@H](C)NCc1ccc2ccccc2c1)C(=O)N[C@@H](C)C(=O)N[C@@H]([C@@H](C)O)C(N)=O