Reaction Details
TargetSomatostatin receptor type 3
LigandBDBM82466
Substrate/Competitorn/a
Ki 24±n/a nM
CommentsPDSP_1034
Citation Raynor, KMurphy, WACoy, DHTaylor, JEMoreau, JPYasuda, KBell, GIReisine, T Cloned somatostatin receptors: identification of subtype-selective peptides and demonstration of high affinity binding of linear peptides. Mol Pharmacol43:838-44 (1993) Somatostatin receptor type 3
Name:Somatostatin receptor type 3
Type:Enzyme Catalytic Domain
Mol. Mass.:47225.49
Organism:MOUSE
Description:SOMATOSTATIN SST3 SSTR3 MOUSE::P30935
Residue:428
BDBM82466
NameBDBM82466
Synonyms:L-362,862 c[Aha-Phe-p-C1-Phe-D-Trp-Lys-Thr-Phe]
TypeSmall organic molecule
Emp. Form.C55H68ClN9O8
Mol. Mass.1018.637
SMILESC[C@@H](O)[C@@H]1NC(=O)[C@H](CCCCN)NC(=O)[C@@H](Cc2c[nH]c3ccccc23)NC(=O)[C@H](Cc2ccccc2)NC(=O)[C@H](Cc2ccc(Cl)cc2)NC(=O)CCCCCCNC(=O)[C@H](Cc2ccccc2)NC1=O