Reaction Details
TargetSomatostatin receptor type 3
LigandBDBM82454
Substrate/Competitorn/a
Ki 18.9±n/a nM
CommentsPDSP_1037
Citation Raynor, KMurphy, WACoy, DHTaylor, JEMoreau, JPYasuda, KBell, GIReisine, T Cloned somatostatin receptors: identification of subtype-selective peptides and demonstration of high affinity binding of linear peptides. Mol Pharmacol43:838-44 (1993) Somatostatin receptor type 3
Name:Somatostatin receptor type 3
Type:Enzyme Catalytic Domain
Mol. Mass.:47225.49
Organism:MOUSE
Description:SOMATOSTATIN SST3 SSTR3 MOUSE::P30935
Residue:428
BDBM82454
NameBDBM82454
Synonyms:L-363,572 | N-Methylcyclo(D-Ala-D-Phe-D-Trp-L-Lys-D-Thr-N-methyl-D-Phe-)
TypeSmall organic molecule
Emp. Form.C44H56N8O7
Mol. Mass.808.9648
SMILESC[C@H](O)[C@H]1NC(=O)[C@H](CCCCN)NC(=O)[C@@H](Cc2c[nH]c3ccccc23)NC(=O)[C@@H](Cc2ccccc2)NC(=O)[C@@H](C)N(C)C(=O)[C@@H](Cc2ccccc2)N(C)C1=O