Reaction Details
TargetSomatostatin receptor type 4
LigandBDBM84640
Substrate/Competitorn/a
Ki 43±n/a nM
CommentsPDSP_390
Citation Raynor, KO'Carroll, AMKong, HYasuda, KMahan, LCBell, GIReisine, T Characterization of cloned somatostatin receptors SSTR4 and SSTR5. Mol Pharmacol44:385-92 (1993) Somatostatin receptor type 4
Name:Somatostatin receptor type 4
Type:Enzyme Catalytic Domain
Mol. Mass.:42096.84
Organism:RAT
Description:SOMATOSTATIN SST4 SSTR4 RAT::P30937
Residue:384
BDBM84640
NameBDBM84640
Synonyms:BIM 23063
TypeSmall organic molecule
Emp. Form.C71H80ClN11O9
Mol. Mass.1266.916
SMILESCC(C)[C@H](NC(=O)[C@H](CCCCN)NC(=O)[C@@H](Cc1c[nH]c2ccccc12)NC(=O)[C@H](Cc1ccc(O)cc1)NC(=O)[C@H](Cc1ccc(Cl)cc1)NC(=O)[C@H](N)Cc1ccccc1)C(=O)N[C@@H](Cc1ccccc1)C(=O)N[C@@H](Cc1ccc2ccccc2c1)C(N)=O