Reaction Details
TargetSomatostatin receptor type 5
LigandBDBM84623
Substrate/Competitorn/a
Ki 1000±n/a nM
CommentsPDSP_1294
Citation Raynor, KO'Carroll, AMKong, HYasuda, KMahan, LCBell, GIReisine, T Characterization of cloned somatostatin receptors SSTR4 and SSTR5. Mol Pharmacol44:385-92 (1993) Somatostatin receptor type 5
Name:Somatostatin receptor type 5
Type:Enzyme
Mol. Mass.:39218.02
Organism:Homo sapiens (Human)
Description:P35346
Residue:364
BDBM84623
NameBDBM84623
Synonyms:NC4-28B
TypeSmall organic molecule
Emp. Form.C55H64N10O9S2
Mol. Mass.1073.288
SMILESNCCCCC1NC(=O)C(Cc2c[nH]c3ccccc23)NC(=O)C(Cc2ccc(O)cc2)NC(=O)C(CSSCC(NC(=O)C(CO)NC1=O)C(=O)NCc1cccc2ccccc12)NC(=O)C(N)Cc1ccccc1