Reaction Details
Target5-hydroxytryptamine receptor 4
LigandBDBM84648
Substrate/Competitorn/a
Ki 12.58±n/a nM
CommentsPDSP_400
Citation Grossman, CJKilpatrick, GJBunce, KT Development of a radioligand binding assay for 5-HT4 receptors in guinea-pig and rat brain. Br J Pharmacol109:618-24 (1993) 
 
5-hydroxytryptamine receptor 4
Name:5-hydroxytryptamine receptor 4
Type:Enzyme Catalytic Domain
Mol. Mass.:43735.29
Organism:GUINEA PIG
Description:5-HT4 HTR4 GUINEA PIG::O70528
Residue:388
BDBM84648
NameBDBM84648
Synonyms:BIMU 8
TypeSmall organic molecule
Emp. Form.C19H26N4O2
Mol. Mass.342.4353
SMILESCC(C)n1c2ccccc2n(C(=O)NC2C[C@@H]3CC[C@H](C2)N3C)c1=O