Reaction Details
TargetTrans-sialidase
LigandBDBM50174833
Substrate/Competitorn/a
Meas. Tech.Inhibition Assay
pH7.6±0
Temperature308.15±0 K
Ki 3.7e+3±n/a nM
IC50 2.5e+3±n/a nM
Citation Kim, JHRyu, HWShim, JHPark, KHWithers, SG Development of new and selective Trypanosoma cruzi trans-sialidase inhibitors from sulfonamide chalcones and their derivatives. Chembiochem10:2475-9 (2009) 
 
Trans-sialidase
Name:Trans-sialidase
Synonyms:n/a
Type:n/a
Mol. Mass.:70598.62
Organism:Trypanosoma cruzi
Description:Q26966
Residue:642
BDBM50174833
NameBDBM50174833
TypeSmall organic molecule
Emp. Form.C22H19NO5S
Mol. Mass.409.455
SMILESCc1ccc(cc1)S(=O)(=O)Nc1cccc(c1)C(=O)\C=C\c1ccc(O)c(O)c1