Reaction Details
TargetGamma-aminobutyric acid receptor subunit alpha-3
LigandBDBM50243981
Substrate/Competitorn/a
Ki 9.2±n/a nM
CommentsPDSP_351
Citation Hadingham, KLWingrove, PLe Bourdelles, BPalmer, KJRagan, CIWhiting, PJ Cloning of cDNA sequences encoding human alpha 2 and alpha 3 gamma-aminobutyric acidA receptor subunits and characterization of the benzodiazepine pharmacology of recombinant alpha 1-, alpha 2-, alpha 3-, and alpha 5-containing human gamma-aminobutyric acidA receptors. Mol Pharmacol43:970-5 (1993) Gamma-aminobutyric acid receptor subunit alpha-3
Name:Gamma-aminobutyric acid receptor subunit alpha-3
Type:Enzyme Catalytic Domain
Mol. Mass.:55175.47
Organism:Homo sapiens (Human)
Description:GABA A Alpha3Beta1Gamma2 0 HUMAN::P34903
Residue:492
BDBM50243981
NameBDBM50243981
Synonyms:Beta CCM Methyl Beta-carboline-3 carboxylate | methyl 9H-pyrido[3,4-b]indole-3-carboxylate
TypeSmall organic molecule
Emp. Form.C13H10N2O2
Mol. Mass.226.2307
SMILESCOC(=O)c1cc2c(cn1)[nH]c1ccccc21