Reaction Details
TargetGamma-aminobutyric acid receptor subunit alpha-5
LigandBDBM50001765
Substrate/Competitorn/a
Ki 1.2±n/a nM
CommentsPDSP_1906
Citation Hadingham, KLWingrove, PLe Bourdelles, BPalmer, KJRagan, CIWhiting, PJ Cloning of cDNA sequences encoding human alpha 2 and alpha 3 gamma-aminobutyric acidA receptor subunits and characterization of the benzodiazepine pharmacology of recombinant alpha 1-, alpha 2-, alpha 3-, and alpha 5-containing human gamma-aminobutyric acidA receptors. Mol Pharmacol43:970-5 (1993) Gamma-aminobutyric acid receptor subunit alpha-5
Name:Gamma-aminobutyric acid receptor subunit alpha-5
Type:Enzyme
Mol. Mass.:52160.59
Organism:Homo sapiens (Human)
Description:P31644
Residue:462
BDBM50001765
NameBDBM50001765
Synonyms:8-chloro-6-(2-chlorophenyl)-1-methyl-4H-[1,2,4]triazolo[4,3-a][1,4]benzodiazepine Halcion | TRIAZOLAM
TypeSmall organic molecule
Emp. Form.C17H12Cl2N4
Mol. Mass.343.21
SMILESCc1nnc2CN=C(c3ccccc3Cl)c3cc(Cl)ccc3-n12