Reaction Details
TargetGamma-aminobutyric acid receptor subunit alpha-1
LigandBDBM84740
Substrate/Competitorn/a
Ki 1±n/a nM
CommentsPDSP_969
Citation Giusti, PDucić, IPuia, GArban, RWalser, AGuidotti, ACosta, E Imidazenil: a new partial positive allosteric modulator of gamma-aminobutyric acid (GABA) action at GABAA receptors. J Pharmacol Exp Ther266:1018-28 (1993) Gamma-aminobutyric acid receptor subunit alpha-1
Name:Gamma-aminobutyric acid receptor subunit alpha-1
Type:Enzyme
Mol. Mass.:51770.21
Organism:Rattus norvegicus (Rat)
Description:P62813
Residue:455
BDBM84740
NameBDBM84740
Synonyms:CAS_119194 NSC_119194
TypeSmall organic molecule
Emp. Form.C18H12BrFN4O
Mol. Mass.399.216
SMILESNC(=O)c1ncn-2c1CN=C(c1ccccc1Br)c1cc(F)ccc-21