Reaction Details
TargetSnake venom metalloproteinase BaP1
LigandBDBM50239116
Substrate/Competitorn/a
Meas. Tech.ChEMBL_1665241 (CHEMBL4015037)
Kd 37000.00±n/a nM
Citation Villalta-Romero, FBorro, LMandic, BEscalante, TRucavado, AGutiérrez, JMNeshich, GTasic, L Discovery of small molecule inhibitors for the snake venom metalloprotease BaP1 using in silico and in vitro tests. Bioorg Med Chem Lett27:2018-2022 (2017) 
 
Snake venom metalloproteinase BaP1
Name:Snake venom metalloproteinase BaP1
Type:PROTEIN
Mol. Mass.:45929.07
Organism:Bothrops asper
Description:ChEMBL_840308
Residue:408
BDBM50239116
NameBDBM50239116
Synonyms:CHEMBL4098534
TypeSmall organic molecule
Emp. Form.C13H12N4O5
Mol. Mass.304.2582
SMILESCc1ccc(OCC(=O)N\N=C2/C(=O)NC(=O)N=C2O)cc1