Reaction Details
TargetCarbonic anhydrase 9
LigandBDBM50239279
Substrate/Competitorn/a
Meas. Tech.ChEMBL_1665870 (CHEMBL4015666)
Ki 39±n/a nM
Citation Bruno, EBuemi, MRDi Fiore, ADe Luca, LFerro, SAngeli, ACirilli, RSadutto, DAlterio, VMonti, SMSupuran, CTDe Simone, GGitto, R Probing Molecular Interactions between Human Carbonic Anhydrases (hCAs) and a Novel Class of Benzenesulfonamides. J Med Chem60:4316-4326 (2017) 
 
Carbonic anhydrase 9
Name:Carbonic anhydrase 9
Type:Enzyme
Mol. Mass.:49669.03
Organism:Homo sapiens (Human)
Description:Catalytic domain of human cloned isozyme was used in the assay
Residue:459
BDBM50239279
NameBDBM50239279
Synonyms:CHEMBL4070634
TypeSmall organic molecule
Emp. Form.C23H22N2O4S
Mol. Mass.422.497
SMILESCOc1ccc2C(N(CCc2c1)C(=O)c1ccc(cc1)S(N)(=O)=O)c1ccccc1