Reaction Details
TargetCarbonic anhydrase 2
LigandBDBM50239271
Substrate/Competitorn/a
Meas. Tech.ChEMBL_1665868 (CHEMBL4015664)
Ki 8.9±n/a nM
Citation Bruno, EBuemi, MRDi Fiore, ADe Luca, LFerro, SAngeli, ACirilli, RSadutto, DAlterio, VMonti, SMSupuran, CTDe Simone, GGitto, R Probing Molecular Interactions between Human Carbonic Anhydrases (hCAs) and a Novel Class of Benzenesulfonamides. J Med Chem60:4316-4326 (2017) 
 
Carbonic anhydrase 2
Name:Carbonic anhydrase 2
Type:Enzyme
Mol. Mass.:29250.71
Organism:Homo sapiens (Human)
Description:P00918
Residue:260
BDBM50239271
NameBDBM50239271
Synonyms:CHEMBL4069601
TypeSmall organic molecule
Emp. Form.C24H24N2O5S
Mol. Mass.452.523
SMILESCOc1cc2CCN(C(c3ccccc3)c2cc1OC)C(=O)c1ccc(cc1)S(N)(=O)=O