Reaction Details
TargetCarbonic anhydrase 2
LigandBDBM50239274
Substrate/Competitorn/a
Meas. Tech.ChEMBL_1665868 (CHEMBL4015664)
Ki 5.0±n/a nM
Citation Bruno, EBuemi, MRDi Fiore, ADe Luca, LFerro, SAngeli, ACirilli, RSadutto, DAlterio, VMonti, SMSupuran, CTDe Simone, GGitto, R Probing Molecular Interactions between Human Carbonic Anhydrases (hCAs) and a Novel Class of Benzenesulfonamides. J Med Chem60:4316-4326 (2017) 
 
Carbonic anhydrase 2
Name:Carbonic anhydrase 2
Type:Enzyme
Mol. Mass.:29250.71
Organism:Homo sapiens (Human)
Description:P00918
Residue:260
BDBM50239274
NameBDBM50239274
Synonyms:CHEMBL4079453
TypeSmall organic molecule
Emp. Form.C22H20N2O4S
Mol. Mass.408.47
SMILESNS(=O)(=O)c1ccc(cc1)C(=O)N1CCc2cc(O)ccc2C1c1ccccc1