Reaction Details
TargetCarbonic anhydrase 7
LigandBDBM50239277
Substrate/Competitorn/a
Meas. Tech.ChEMBL_1665869 (CHEMBL4015665)
Ki 0.400000±n/a nM
Citation Bruno, EBuemi, MRDi Fiore, ADe Luca, LFerro, SAngeli, ACirilli, RSadutto, DAlterio, VMonti, SMSupuran, CTDe Simone, GGitto, R Probing Molecular Interactions between Human Carbonic Anhydrases (hCAs) and a Novel Class of Benzenesulfonamides. J Med Chem60:4316-4326 (2017) 
 
Carbonic anhydrase 7
Name:Carbonic anhydrase 7
Type:Enzyme
Mol. Mass.:29664.11
Organism:Homo sapiens (Human)
Description:Human cloned isozyme.
Residue:264
BDBM50239277
NameBDBM50239277
Synonyms:CHEMBL4081248
TypeSmall organic molecule
Emp. Form.C22H19ClN2O5S
Mol. Mass.458.915
SMILESNS(=O)(=O)c1ccc(cc1)C(=O)N1CCc2cc(O)c(O)cc2C1c1ccc(Cl)cc1