Reaction Details
TargetCarbonic anhydrase 2
LigandBDBM50239279
Substrate/Competitorn/a
Meas. Tech.ChEMBL_1665868 (CHEMBL4015664)
Ki 6.0±n/a nM
Citation Bruno, EBuemi, MRDi Fiore, ADe Luca, LFerro, SAngeli, ACirilli, RSadutto, DAlterio, VMonti, SMSupuran, CTDe Simone, GGitto, R Probing Molecular Interactions between Human Carbonic Anhydrases (hCAs) and a Novel Class of Benzenesulfonamides. J Med Chem60:4316-4326 (2017) 
 
Carbonic anhydrase 2
Name:Carbonic anhydrase 2
Type:Enzyme
Mol. Mass.:29250.71
Organism:Homo sapiens (Human)
Description:P00918
Residue:260
BDBM50239279
NameBDBM50239279
Synonyms:CHEMBL4070634
TypeSmall organic molecule
Emp. Form.C23H22N2O4S
Mol. Mass.422.497
SMILESCOc1ccc2C(N(CCc2c1)C(=O)c1ccc(cc1)S(N)(=O)=O)c1ccccc1