Reaction Details
TargetVoltage-dependent L-type calcium channel subunit alpha-1S
LigandBDBM50000350
Substrate/Competitorn/a
Meas. Tech.ChEBML_53192
Kd 2000±n/a nM
Citation Kimball, SDFloyd, DMDas, JHunt, JTKrapcho, JRovnyak, GDuff, KJLee, VGMoquin, RVTurk, CF Benzazepinone calcium channel blockers. 4. Structure-activity overview and intracellular binding site. J Med Chem35:780-93 (1992) Voltage-dependent L-type calcium channel subunit alpha-1S
Name:Voltage-dependent L-type calcium channel subunit alpha-1S
Type:PROTEIN
Mol. Mass.:212348.33
Organism:Homo sapiens (Human)
Description:ChEMBL_42767
Residue:1873
BDBM50000350
NameBDBM50000350
Synonyms:3-Acetoxy-1-(2-dimethylamino-ethyl)-4-(4-methoxy-phenyl)-2-oxo-2,3,4,5-tetrahydro-1H-benzo[b]azepine-6-carboxylic acid ethyl ester | CHEMBL163719
TypeSmall organic molecule
Emp. Form.C26H32N2O6
Mol. Mass.468.5421
SMILESCCOC(=O)c1cccc2N(CCN(C)C)C(=O)[C@H](OC(C)=O)[C@@H](Cc12)c1ccc(OC)cc1