Reaction Details
TargetVoltage-dependent L-type calcium channel subunit alpha-1S
LigandBDBM50000373
Substrate/Competitorn/a
Meas. Tech.ChEBML_53192
Kd 420±n/a nM
Citation Kimball, SDFloyd, DMDas, JHunt, JTKrapcho, JRovnyak, GDuff, KJLee, VGMoquin, RVTurk, CF Benzazepinone calcium channel blockers. 4. Structure-activity overview and intracellular binding site. J Med Chem35:780-93 (1992) Voltage-dependent L-type calcium channel subunit alpha-1S
Name:Voltage-dependent L-type calcium channel subunit alpha-1S
Type:PROTEIN
Mol. Mass.:212348.33
Organism:Homo sapiens (Human)
Description:ChEMBL_42767
Residue:1873
BDBM50000373
NameBDBM50000373
Synonyms:Acetic acid 1-[2-(allyl-methyl-amino)-ethyl]-4-(4-methoxy-phenyl)-2-oxo-6-trifluoromethyl-2,3,4,5-tetrahydro-1H-benzo[b]azepin-3-yl ester | CHEMBL164134
TypeSmall organic molecule
Emp. Form.C26H29F3N2O4
Mol. Mass.490.5147
SMILESCOc1ccc(cc1)[C@@H]1Cc2c(cccc2C(F)(F)F)N(CCN(C)CC=C)C(=O)[C@@H]1OC(C)=O