Reaction Details
TargetVoltage-dependent L-type calcium channel subunit alpha-1S
LigandBDBM50000372
Substrate/Competitorn/a
Meas. Tech.ChEBML_53192
Kd 660.0±n/a nM
Citation Kimball, SDFloyd, DMDas, JHunt, JTKrapcho, JRovnyak, GDuff, KJLee, VGMoquin, RVTurk, CF Benzazepinone calcium channel blockers. 4. Structure-activity overview and intracellular binding site. J Med Chem35:780-93 (1992) Voltage-dependent L-type calcium channel subunit alpha-1S
Name:Voltage-dependent L-type calcium channel subunit alpha-1S
Type:PROTEIN
Mol. Mass.:212348.33
Organism:Homo sapiens (Human)
Description:ChEMBL_42767
Residue:1873
BDBM50000372
NameBDBM50000372
Synonyms:1-(2-Dimethylamino-ethyl)-3-hydroxy-4-(4-methoxy-phenyl)-6-trifluoromethyl-1,3,4,5-tetrahydro-benzo[b]azepin-2-one | CHEMBL351235
TypeSmall organic molecule
Emp. Form.C22H25F3N2O3
Mol. Mass.422.4407
SMILESCOc1ccc(cc1)[C@@H]1Cc2c(cccc2C(F)(F)F)N(CCN(C)C)C(=O)[C@@H]1O