Reaction Details
TargetVoltage-dependent L-type calcium channel subunit alpha-1S
LigandBDBM50000380
Substrate/Competitorn/a
Meas. Tech.ChEBML_53192
Kd 1600±n/a nM
Citation Kimball, SDFloyd, DMDas, JHunt, JTKrapcho, JRovnyak, GDuff, KJLee, VGMoquin, RVTurk, CF Benzazepinone calcium channel blockers. 4. Structure-activity overview and intracellular binding site. J Med Chem35:780-93 (1992) Voltage-dependent L-type calcium channel subunit alpha-1S
Name:Voltage-dependent L-type calcium channel subunit alpha-1S
Type:PROTEIN
Mol. Mass.:212348.33
Organism:Homo sapiens (Human)
Description:ChEMBL_42767
Residue:1873
BDBM50000380
NameBDBM50000380
Synonyms:Acetic acid 1-(2-dimethylamino-ethyl)-7-methoxy-4-(4-methoxy-phenyl)-2-oxo-2,3,4,5-tetrahydro-1H-benzo[b]azepin-3-yl ester | CHEMBL354933
TypeSmall organic molecule
Emp. Form.C24H30N2O5
Mol. Mass.426.5054
SMILESCOc1ccc(cc1)[C@@H]1Cc2cc(OC)ccc2N(CCN(C)C)C(=O)[C@@H]1OC(C)=O