Reaction Details
TargetD(3) dopamine receptor
LigandBDBM50395587
Substrate/Competitorn/a
Meas. Tech.ChEMBL_1666012 (CHEMBL4015808)
Ki 1.9±n/a nM
Citation Männel, BDengler, DShonberg, JHübner, HMöller, DGmeiner, P Hydroxy-Substituted Heteroarylpiperazines: Novel Scaffolds for?-Arrestin-Biased D J Med Chem60:4693-4713 (2017) 
 
D(3) dopamine receptor
Name:D(3) dopamine receptor
Type:n/a
Mol. Mass.:44243.43
Organism:Homo sapiens (Human)
Description:n/a
Residue:400
BDBM50395587
NameBDBM50395587
Synonyms:CHEMBL2165126 US9156822, 2
TypeSmall organic molecule
Emp. Form.C24H29Cl2N3O2
Mol. Mass.462.412
SMILESClc1cccc(N2CCCN(CCCCOc3ccc4CCC(=O)Nc4c3)CC2)c1Cl