Reaction Details
TargetDelta-type opioid receptor
LigandBDBM50000520
Substrate/Competitorn/a
Meas. Tech.ChEMBL_217857 (CHEMBL822180)
Ki 2.8±n/a nM
Citation Lazarus, LHSalvadori, SBalboni, GTomatis, RWilson, WE Stereospecificity of amino acid side chains in deltorphin defines binding to opioid receptors. J Med Chem35:1222-7 (1992) Delta-type opioid receptor
Name:Delta-type opioid receptor
Type:G Protein-Coupled Receptor (GPCR)
Mol. Mass.:40465.04
Organism:Rattus norvegicus (rat)
Description:Competition binding assays were using CHO-K1 cell membranes expressing the opioid receptor.
Residue:372
BDBM50000520
NameBDBM50000520
Synonyms:3-(2-{2-[2-(2-{2-[2-Amino-3-(4-hydroxy-phenyl)-propionylamino]-4-methylsulfanyl-butyrylamino}-3-phenyl-propionylamino)-3-(3H-imidazol-4-yl)-propionylamino]-4-methyl-pentanoylamino}-4-methylsulfanyl-butyrylamino)-succinamic acid | CHEMBL277249
TypeSmall organic molecule
Emp. Form.C44H62N10O10S2
Mol. Mass.955.154
SMILESCSCC[C@@H](NC(=O)[C@@H](N)Cc1ccc(O)cc1)C(=O)N[C@@H](Cc1ccccc1)C(=O)N[C@H](Cc1cnc[nH]1)C(=O)N[C@@H](CC(C)C)C(=O)N[C@@H](CCSC)C(=O)N[C@@H](CC(O)=O)C(N)=O