Reaction Details
TargetKappa-type opioid receptor
LigandBDBM50001683
Substrate/Competitorn/a
Meas. Tech.ChEMBL_145994 (CHEMBL750588)
Ki>350±n/a nM
Citation Froimowitz, MPick, CGPasternak, GW Phenylmorphans and analogues: opioid receptor subtype selectivity and effect of conformation on activity. J Med Chem35:1521-5 (1992) Kappa-type opioid receptor
Name:Kappa-type opioid receptor
Type:G Protein-Coupled Receptor (GPCR)
Mol. Mass.:42648.76
Organism:Homo sapiens (Human)
Description:P41145
Residue:380
BDBM50001683
NameBDBM50001683
Synonyms:13-[2-Amino-3-(4-hydroxy-phenyl)-propionylamino]-7-benzyl-3,3,14,14-tetramethyl-6,9,12-trioxo-1,2-dithia-5,8,11-triaza-cyclotetradecane-4-carboxylic acid CHEMBL294616 | DPDPE
TypeSmall organic molecule
Emp. Form.C30H39N5O7S2
Mol. Mass.645.79
SMILESCC1(C)SSC(C)(C)[C@@H](NC(=O)[C@@H](N)Cc2ccc(O)cc2)C(=O)NCC(=O)N[C@H](Cc2ccccc2)C(=O)N[C@H]1C(O)=O