Reaction Details
TargetDelta-type opioid receptor
LigandBDBM50000570
Substrate/Competitorn/a
Meas. Tech.ChEBML_146728
Ki>500±n/a nM
Citation Froimowitz, MPick, CGPasternak, GW Phenylmorphans and analogues: opioid receptor subtype selectivity and effect of conformation on activity. J Med Chem35:1521-5 (1992) Delta-type opioid receptor
Name:Delta-type opioid receptor
Type:G Protein-Coupled Receptor (GPCR)
Mol. Mass.:40382.98
Organism:Homo sapiens (Human)
Description:Competition binding assays were carried out using membrane preparations from transfected HN9.10 cells that constitutively expressed the delta opioid receptor.
Residue:372
BDBM50000570
NameBDBM50000570
Synonyms:3-(2-Methyl-2-aza-bicyclo[3.3.1]non-5-yl)-phenol | CHEMBL285250
TypeSmall organic molecule
Emp. Form.C15H21NO
Mol. Mass.231.3333
SMILESCN1CCC2(CCCC1C2)c1cccc(O)c1