Reaction Details
TargetMu-type opioid receptor
LigandBDBM50000571
Substrate/Competitorn/a
Meas. Tech.ChEMBL_149460 (CHEMBL758211)
Ki 50.0±n/a nM
Citation Froimowitz, MPick, CGPasternak, GW Phenylmorphans and analogues: opioid receptor subtype selectivity and effect of conformation on activity. J Med Chem35:1521-5 (1992) Mu-type opioid receptor
Name:Mu-type opioid receptor
Type:Enzyme Catalytic Domain
Mol. Mass.:45038.37
Organism:CALF
Description:OPIATE Mu 2 0 CALF::P79350
Residue:401
BDBM50000571
NameBDBM50000571
Synonyms:3-(2,9-Dimethyl-2-aza-bicyclo[3.3.1]non-5-yl)-phenol CHEMBL287726
TypeSmall organic molecule
Emp. Form.C16H23NO
Mol. Mass.245.3599
SMILESC[C@@H]1C2CCCC1(CCN2C)c1cccc(O)c1