Reaction Details
TargetCytochrome P450 1A1
LigandBDBM50239592
Substrate/Competitorn/a
Meas. Tech.ChEMBL_1666483 (CHEMBL4016279)
Ki 540.00±n/a nM
Citation Fortin, SCharest-Morin, XTurcotte, VLauvaux, CLacroix, JCôté, MFGobeil, SC-Gaudreault, R Activation of Phenyl 4-(2-Oxo-3-alkylimidazolidin-1-yl)benzenesulfonates Prodrugs by CYP1A1 as New Antimitotics Targeting Breast Cancer Cells. J Med Chem60:4963-4982 (2017) 
 
Cytochrome P450 1A1
Name:Cytochrome P450 1A1
Type:Protein
Mol. Mass.:58177.23
Organism:Homo sapiens (Human)
Description:P04798
Residue:512
BDBM50239592
NameBDBM50239592
Synonyms:CHEMBL4078072
TypeSmall organic molecule
Emp. Form.C22H28N2O7S
Mol. Mass.464.532
SMILESCCCCN1CCN(C1=O)c1ccc(cc1)S(=O)(=O)Oc1cc(OC)c(OC)c(OC)c1