Reaction Details
TargetCytochrome P450 11B2, mitochondrial
LigandBDBM50239810
Substrate/Competitorn/a
Meas. Tech.ChEBML_1667113
IC50 8.0±n/a nM
Citation Emmerich, Jvan Koppen, CJBurkhart, JLHu, QSiebenbürger, LBoerger, CScheuer, CLaschke, MWMenger, MDHartmann, RW Lead Optimization Generates CYP11B1 Inhibitors of Pyridylmethyl Isoxazole Type with Improved Pharmacological Profile for the Treatment of Cushing's Disease. J Med Chem60:5086-5098 (2017) 
 
Cytochrome P450 11B2, mitochondrial
Name:Cytochrome P450 11B2, mitochondrial
Type:Protein
Mol. Mass.:57582.15
Organism:Homo sapiens (Human)
Description:P19099
Residue:503
BDBM50239810
NameBDBM50239810
Synonyms:CHEMBL4093884
TypeSmall organic molecule
Emp. Form.C16H14N2S
Mol. Mass.266.361
SMILESCc1cncc(Cc2cc(ns2)-c2ccccc2)c1