Reaction Details
TargetCytochrome P450 11B2, mitochondrial
LigandBDBM50239790
Substrate/Competitorn/a
Meas. Tech.ChEBML_1667113
IC50 82±n/a nM
Citation Emmerich, Jvan Koppen, CJBurkhart, JLHu, QSiebenbürger, LBoerger, CScheuer, CLaschke, MWMenger, MDHartmann, RW Lead Optimization Generates CYP11B1 Inhibitors of Pyridylmethyl Isoxazole Type with Improved Pharmacological Profile for the Treatment of Cushing's Disease. J Med Chem60:5086-5098 (2017) 
 
Cytochrome P450 11B2, mitochondrial
Name:Cytochrome P450 11B2, mitochondrial
Type:Protein
Mol. Mass.:57582.15
Organism:Homo sapiens (Human)
Description:P19099
Residue:503
BDBM50239790
NameBDBM50239790
Synonyms:CHEMBL4079276
TypeSmall organic molecule
Emp. Form.C16H14N2O
Mol. Mass.250.2952
SMILESCc1cncc(Cc2cc(no2)-c2ccccc2)c1