Reaction Details
TargetCytochrome P450 11B1, mitochondrial
LigandBDBM50239802
Substrate/Competitorn/a
Meas. Tech.ChEBML_1667112
IC50 2.0±n/a nM
Citation Emmerich, Jvan Koppen, CJBurkhart, JLHu, QSiebenbürger, LBoerger, CScheuer, CLaschke, MWMenger, MDHartmann, RW Lead Optimization Generates CYP11B1 Inhibitors of Pyridylmethyl Isoxazole Type with Improved Pharmacological Profile for the Treatment of Cushing's Disease. J Med Chem60:5086-5098 (2017) 
 
Cytochrome P450 11B1, mitochondrial
Name:Cytochrome P450 11B1, mitochondrial
Type:Enzyme
Mol. Mass.:57591.44
Organism:Homo sapiens (Human)
Description:P15538
Residue:503
BDBM50239802
NameBDBM50239802
Synonyms:CHEMBL4079408
TypeSmall organic molecule
Emp. Form.C18H15FN2O2S
Mol. Mass.342.387
SMILESCc1cncc(Cc2ccc(nc2)S(=O)(=O)c2ccccc2F)c1