Reaction Details
TargetCytochrome P450 11B1, mitochondrial
LigandBDBM50028166
Substrate/Competitorn/a
Meas. Tech.ChEBML_1667112
IC50 15±n/a nM
Citation Emmerich, Jvan Koppen, CJBurkhart, JLHu, QSiebenbürger, LBoerger, CScheuer, CLaschke, MWMenger, MDHartmann, RW Lead Optimization Generates CYP11B1 Inhibitors of Pyridylmethyl Isoxazole Type with Improved Pharmacological Profile for the Treatment of Cushing's Disease. J Med Chem60:5086-5098 (2017) 
 
Cytochrome P450 11B1, mitochondrial
Name:Cytochrome P450 11B1, mitochondrial
Type:Enzyme
Mol. Mass.:57591.44
Organism:Homo sapiens (Human)
Description:P15538
Residue:503
BDBM50028166
NameBDBM50028166
Synonyms:CHEMBL934 US9138393, Metyrapone US9394290, MTP (metyrapone)
TypeSmall organic molecule
Emp. Form.C14H14N2O
Mol. Mass.226.2738
SMILESCC(C)(C(=O)c1cccnc1)c1cccnc1