Reaction Details
TargetCalcitonin gene-related peptide type 1 receptor
LigandBDBM50000743
Substrate/Competitorn/a
Meas. Tech.ChEBML_42602
IC50 2.30±n/a nM
Citation Mimeault, MQuirion, RDumont, YSt-Pierre, SFournier, A Structure-activity study of hCGRP8-37, a calcitonin gene-related peptide receptor antagonist. J Med Chem35:2163-8 (1992) Calcitonin gene-related peptide type 1 receptor
Name:Calcitonin gene-related peptide type 1 receptor
Type:PROTEIN
Mol. Mass.:53330.91
Organism:Rattus norvegicus
Description:ChEMBL_1457286
Residue:464
BDBM50000743
NameBDBM50000743
Synonyms:CHEMBL525571 h alpha-CGRP8-37
TypeSmall organic molecule
Emp. Form.C139H230N44O38
Mol. Mass.3125.5855
SMILESCC(C)C[C@H](NC(=O)CNC(=O)[C@H](C)NC(=O)[C@H](CC(C)C)NC(=O)[C@H](CCCNC(N)=N)NC(=O)[C@H](Cc1cnc[nH]1)NC(=O)[C@@H](NC(=O)[C@@H](N)C(C)C)[C@@H](C)O)C(=O)N[C@@H](CC(C)C)C(=O)N[C@@H](CO)C(=O)N[C@@H](CCCNC(N)=N)C(=O)N[C@@H](CO)C(=O)NCC(=O)NCC(=O)N[C@@H](C(C)C)C(=O)N[C@@H](C(C)C)C(=O)N[C@@H](CCCCN)C(=O)N[C@@H](CC(N)=O)C(=O)N[C@@H](CC(N)=O)C(=O)N[C@@H](Cc1ccccc1)C(=O)N[C@@H](C(C)C)C(=O)N1CCC[C@H]1C(=O)N[C@@H]([C@@H](C)O)C(=O)N[C@@H](CC(N)=O)C(=O)N[C@@H](C(C)C)C(=O)NCC(=O)N[C@@H](CO)C(=O)N[C@@H](CCCCN)C(=O)N[C@@H](C)C(=O)N[C@@H](Cc1ccccc1)C(N)=O