Reaction Details
TargetHistone deacetylase 1
LigandBDBM50239824
Substrate/Competitorn/a
Meas. Tech.ChEMBL_1667231 (CHEMBL4017027)
IC50 25±n/a nM
Citation Krieger, VHamacher, AGertzen, CGWSenger, JZwinderman, MRHMarek, MRomier, CDekker, FJKurz, TJung, MGohlke, HKassack, MUHansen, FK Design, Multicomponent Synthesis, and Anticancer Activity of a Focused Histone Deacetylase (HDAC) Inhibitor Library with Peptoid-Based Cap Groups. J Med Chem60:5493-5506 (2017) 
 
Histone deacetylase 1
Name:Histone deacetylase 1
Type:Enzyme
Mol. Mass.:55090.27
Organism:Homo sapiens (Human)
Description:Q13547
Residue:482
BDBM50239824
NameBDBM50239824
Synonyms:CHEMBL4069631
TypeSmall organic molecule
Emp. Form.C24H32N4O4
Mol. Mass.440.5353
SMILESCN(C)c1ccc(cc1)C(=O)N(CCCCCC(=O)NO)CC(=O)NCc1ccccc1