Reaction Details
TargetPotassium voltage-gated channel subfamily H member 2
LigandBDBM50239824
Substrate/Competitorn/a
Meas. Tech.ChEMBL_1667238 (CHEMBL4017034)
IC50 50800±n/a nM
Citation Krieger, VHamacher, AGertzen, CGWSenger, JZwinderman, MRHMarek, MRomier, CDekker, FJKurz, TJung, MGohlke, HKassack, MUHansen, FK Design, Multicomponent Synthesis, and Anticancer Activity of a Focused Histone Deacetylase (HDAC) Inhibitor Library with Peptoid-Based Cap Groups. J Med Chem60:5493-5506 (2017) 
 
Potassium voltage-gated channel subfamily H member 2
Name:Potassium voltage-gated channel subfamily H member 2
Type:Multi-pass membrane protein
Mol. Mass.:126672.65
Organism:Homo sapiens (Human)
Description:Q12809
Residue:1159
BDBM50239824
NameBDBM50239824
Synonyms:CHEMBL4069631
TypeSmall organic molecule
Emp. Form.C24H32N4O4
Mol. Mass.440.5353
SMILESCN(C)c1ccc(cc1)C(=O)N(CCCCCC(=O)NO)CC(=O)NCc1ccccc1