Reaction Details
TargetcGMP-dependent 3',5'-cyclic phosphodiesterase
LigandBDBM50239848
Substrate/Competitorn/a
Meas. Tech.ChEMBL_1667258 (CHEMBL4017054)
IC50 115±n/a nM
Citation Helal, CJArnold, EPBoyden, TLChang, CChappie, TAFennell, KFForman, MDHajos, MHarms, JFHoffman, WEHumphrey, JMKang, ZKleiman, RJKormos, BLLee, CWLu, JMaklad, NMcDowell, LMente, SO'Connor, REPandit, JPiotrowski, MSchmidt, AWSchmidt, CJUeno, HVerhoest, PRYang, EX Application of Structure-Based Design and Parallel Chemistry to Identify a Potent, Selective, and Brain Penetrant Phosphodiesterase 2A Inhibitor. J Med Chem60:5673-5698 (2017) 
 
cGMP-dependent 3',5'-cyclic phosphodiesterase
Name:cGMP-dependent 3',5'-cyclic phosphodiesterase
Type:Enzyme Catalytic Domain
Mol. Mass.:105691.58
Organism:Homo sapiens (Human)
Description:O00408
Residue:941
BDBM50239848
NameBDBM50239848
Synonyms:CHEMBL4098897
TypeSmall organic molecule
Emp. Form.C18H15F3N6O
Mol. Mass.388.3465
SMILESCCCOc1cncc2nnc(-c3c[nH]nc3-c3ccc(cc3)C(F)(F)F)n12