Reaction Details
TargetBile salt export pump
LigandBDBM50121347
Substrate/Competitorn/a
Meas. Tech.ChEMBL_1667662 (CHEMBL4017550)
IC50 560000±n/a nM
Citation Warner, DJChen, HCantin, LDKenna, JGStahl, SWalker, CLNoeske, T Mitigating the inhibition of human bile salt export pump by drugs: opportunities provided by physicochemical property modulation, in silico modeling, and structural modification. Drug Metab Dispos40:2332-41 (2012) 
 
Bile salt export pump
Name:Bile salt export pump
Type:Protein
Mol. Mass.:146405.49
Organism:Homo sapiens (Human)
Description:O95342
Residue:1321
BDBM50121347
NameBDBM50121347
Synonyms:CHEMBL625 | THIABENDAZOLE
TypeSmall organic molecule
Emp. Form.C10H7N3S
Mol. Mass.201.248
SMILESc1nc(cs1)-c1nc2ccccc2[nH]1