Reaction Details
TargetBile salt export pump
LigandBDBM50240424
Substrate/Competitorn/a
Meas. Tech.ChEMBL_1667662 (CHEMBL4017550)
IC50>1000000±n/a nM
Citation Warner, DJChen, HCantin, LDKenna, JGStahl, SWalker, CLNoeske, T Mitigating the inhibition of human bile salt export pump by drugs: opportunities provided by physicochemical property modulation, in silico modeling, and structural modification. Drug Metab Dispos40:2332-41 (2012) 
 
Bile salt export pump
Name:Bile salt export pump
Type:Protein
Mol. Mass.:146405.49
Organism:Homo sapiens (Human)
Description:O95342
Residue:1321
BDBM50240424
NameBDBM50240424
Synonyms:3-Ethyl-3-methyl-pyrrolidine-2,5-dione 3-Ethyl-3-methyl-pyrrolidine-2,5-dione(ethosuximide) CHEMBL696 CN-10395 PM-671 zarontin3-Ethyl-3-methyl-pyrrolidine-2,5-dione
TypeSmall organic molecule
Emp. Form.C7H11NO2
Mol. Mass.141.1677
SMILESCCC1(C)CC(=O)NC1=O