Reaction Details
TargetBile salt export pump
LigandBDBM50188311
Substrate/Competitorn/a
Meas. Tech.ChEMBL_1667662 (CHEMBL4017550)
IC50<10000±n/a nM
Citation Warner, DJChen, HCantin, LDKenna, JGStahl, SWalker, CLNoeske, T Mitigating the inhibition of human bile salt export pump by drugs: opportunities provided by physicochemical property modulation, in silico modeling, and structural modification. Drug Metab Dispos40:2332-41 (2012) 
 
Bile salt export pump
Name:Bile salt export pump
Type:Protein
Mol. Mass.:146405.49
Organism:Homo sapiens (Human)
Description:O95342
Residue:1321
BDBM50188311
NameBDBM50188311
Synonyms:2-(3-(8-chloroquinolin-4-yl)-2,5-dimethyl-1H-indol-1-yl)acetic acid | CHEMBL378730
TypeSmall organic molecule
Emp. Form.C21H17ClN2O2
Mol. Mass.364.825
SMILESCc1c(-c2ccnc3c(Cl)cccc23)c2cc(C)ccc2n1CC(O)=O