Reaction Details
TargetBile salt export pump
LigandBDBM50085045
Substrate/Competitorn/a
Meas. Tech.ChEMBL_1667662 (CHEMBL4017550)
IC50 6900±n/a nM
Citation Warner, DJChen, HCantin, LDKenna, JGStahl, SWalker, CLNoeske, T Mitigating the inhibition of human bile salt export pump by drugs: opportunities provided by physicochemical property modulation, in silico modeling, and structural modification. Drug Metab Dispos40:2332-41 (2012) 
 
Bile salt export pump
Name:Bile salt export pump
Type:Protein
Mol. Mass.:146405.49
Organism:Homo sapiens (Human)
Description:O95342
Residue:1321
BDBM50085045
NameBDBM50085045
Synonyms:5-((4-((6-hydroxy-2,5,7,8-tetramethyl-3,4-dihydro-2H-chromen-2-yl)methoxy)phenyl)methyl)thiazolidine-2,4-dione 5-[4-(6-Hydroxy-2,5,7,8-tetramethyl-chroman-2-ylmethoxy)-benzy l]-thiazolidine-2,4-dione (troglitazone) 5-[4-(6-Hydroxy-2,5,7,8-tetramethyl-chroman-2-ylmethoxy)-benzyl]-thiazolidine-2,4-dione(troglitazone) CHEMBL408 CS-045 PRELAY TROGLITAZONE
TypeSmall organic molecule
Emp. Form.C24H27NO5S
Mol. Mass.441.54
SMILESCc1c(C)c2OC(C)(COc3ccc(Cc4sc(=O)[nH]c4O)cc3)CCc2c(C)c1O