Reaction Details
TargetBile salt export pump
LigandBDBM50331515
Substrate/Competitorn/a
Meas. Tech.ChEMBL_1667662 (CHEMBL4017550)
IC50 68910±n/a nM
Citation Warner, DJChen, HCantin, LDKenna, JGStahl, SWalker, CLNoeske, T Mitigating the inhibition of human bile salt export pump by drugs: opportunities provided by physicochemical property modulation, in silico modeling, and structural modification. Drug Metab Dispos40:2332-41 (2012) 
 
Bile salt export pump
Name:Bile salt export pump
Type:Protein
Mol. Mass.:146405.49
Organism:Homo sapiens (Human)
Description:O95342
Residue:1321
BDBM50331515
NameBDBM50331515
Synonyms:CHEMBL1708 Paroxetine hydrochloride Paxil | Paxil cr
TypeSmall organic molecule
Emp. Form.C19H20FNO3
Mol. Mass.329.3654
SMILESFc1ccc(cc1)[C@@H]1CCNC[C@H]1COc1ccc2OCOc2c1