Reaction Details
TargetBile salt export pump
LigandBDBM50017656
Substrate/Competitorn/a
Meas. Tech.ChEMBL_1667662 (CHEMBL4017550)
IC50>1000000±n/a nM
Citation Warner, DJChen, HCantin, LDKenna, JGStahl, SWalker, CLNoeske, T Mitigating the inhibition of human bile salt export pump by drugs: opportunities provided by physicochemical property modulation, in silico modeling, and structural modification. Drug Metab Dispos40:2332-41 (2012) 
 
Bile salt export pump
Name:Bile salt export pump
Type:Protein
Mol. Mass.:146405.49
Organism:Homo sapiens (Human)
Description:O95342
Residue:1321
BDBM50017656
NameBDBM50017656
Synonyms:CHEMBL1193 Naphcon-A PHENIRAMINE | Visine-A
TypeSmall organic molecule
Emp. Form.C16H20N2
Mol. Mass.240.3434
SMILESCN(C)CCC(c1ccccc1)c1ccccn1