Reaction Details
TargetBile salt export pump
LigandBDBM50240426
Substrate/Competitorn/a
Meas. Tech.ChEMBL_1667662 (CHEMBL4017550)
IC50 197400±n/a nM
Citation Warner, DJChen, HCantin, LDKenna, JGStahl, SWalker, CLNoeske, T Mitigating the inhibition of human bile salt export pump by drugs: opportunities provided by physicochemical property modulation, in silico modeling, and structural modification. Drug Metab Dispos40:2332-41 (2012) 
 
Bile salt export pump
Name:Bile salt export pump
Type:Protein
Mol. Mass.:146405.49
Organism:Homo sapiens (Human)
Description:O95342
Residue:1321
BDBM50240426
NameBDBM50240426
Synonyms:(2S,5R,6R)-6-{[(2R)-2-{[(4-ethyl-2,3-dioxopiperazin-1-yl)carbonyl]amino}-2-phenylacetyl]amino}-3,3-dimethyl-7-oxo-4-thia-1-azabicyclo[3.2.0]heptane-2-carboxylic acid CHEMBL702 Piperacillin anhydrous
TypeSmall organic molecule
Emp. Form.C23H27N5O7S
Mol. Mass.517.555
SMILESCCN1CCN(C(=O)N[C@@H](C(=O)N[C@H]2[C@H]3SC(C)(C)[C@@H](N3C2=O)C(O)=O)c2ccccc2)C(=O)C1=O