Reaction Details
TargetP2Y purinoceptor 12
LigandBDBM50000890
Substrate/Competitorn/a
Meas. Tech.ChEBML_162869
EC50 90±n/a nM
Citation Meanwell, NAPearce, BCRoth, HRSmith, ECWedding, DLWright, JJBuchanan, JOBaryla, UMGamberdella, MGillespie, E Inhibitors of blood platelet cAMP phosphodiesterase. 2. Structure-activity relationships associated with 1,3-dihydro-2H-imidazo[4,5-b]quinolin-2-ones substituted with functionalized side chains. J Med Chem35:2672-87 (1992) P2Y purinoceptor 12
Name:P2Y purinoceptor 12
Type:Enzyme
Mol. Mass.:39458.48
Organism:Homo sapiens (Human)
Description:Q9H244
Residue:342
BDBM50000890
NameBDBM50000890
Synonyms:6-(2-Oxo-2,3-dihydro-1H-imidazo[4,5-b]quinolin-7-yloxy)-hexanoic acid methyl ester | CHEMBL91837
TypeSmall organic molecule
Emp. Form.C17H19N3O4
Mol. Mass.329.3505
SMILESCOC(=O)CCCCCOc1ccc2nc3[nH]c(=O)[nH]c3cc2c1