Reaction Details
TargetP2Y purinoceptor 12
LigandBDBM50000910
Substrate/Competitorn/a
Meas. Tech.ChEMBL_162869 (CHEMBL767230)
EC50 20±n/a nM
Citation Meanwell, NAPearce, BCRoth, HRSmith, ECWedding, DLWright, JJBuchanan, JOBaryla, UMGamberdella, MGillespie, E Inhibitors of blood platelet cAMP phosphodiesterase. 2. Structure-activity relationships associated with 1,3-dihydro-2H-imidazo[4,5-b]quinolin-2-ones substituted with functionalized side chains. J Med Chem35:2672-87 (1992) P2Y purinoceptor 12
Name:P2Y purinoceptor 12
Type:Enzyme
Mol. Mass.:39458.48
Organism:Homo sapiens (Human)
Description:Q9H244
Residue:342
BDBM50000910
NameBDBM50000910
Synonyms:6-(2-Oxo-2,3-dihydro-1H-imidazo[4,5-b]quinolin-7-yloxy)-hexanoic acid cyclohexyl-methyl-amide | CHEMBL91527
TypeSmall organic molecule
Emp. Form.C23H30N4O3
Mol. Mass.410.5093
SMILESCN(C1CCCCC1)C(=O)CCCCCOc1ccc2nc3[nH]c(=O)[nH]c3cc2c1