Reaction Details
TargetLysine-specific histone demethylase 1A
LigandBDBM50240129
Substrate/Competitorn/a
Meas. Tech.ChEMBL_1667720 (CHEMBL4017608)
Ki 1400±n/a nM
Citation Amano, YKikuchi, MSato, SYokoyama, SUmehara, TUmezawa, NHiguchi, T Development and crystallographic evaluation of histone H3 peptide with N-terminal serine substitution as a potent inhibitor of lysine-specific demethylase 1. Bioorg Med Chem25:2617-2624 (2017) 
 
Lysine-specific histone demethylase 1A
Name:Lysine-specific histone demethylase 1A
Type:Enzyme
Mol. Mass.:92901.01
Organism:Homo sapiens (Human)
Description:O60341
Residue:852
BDBM50240129
NameBDBM50240129
Synonyms:CHEMBL4080345
TypeSmall organic molecule
Emp. Form.C92H167N35O28S
Mol. Mass.2243.593
SMILESCSCC[C@H](NC(=O)[C@@H](NC(=O)[C@H](CCCNC(N)=N)NC(=O)[C@H](C)N)[C@@H](C)O)C(=O)N[C@@H](CCC(N)=O)C(=O)N[C@@H]([C@@H](C)O)C(=O)N[C@@H](C)C(=O)N[C@@H](CCCNC(N)=N)C(=O)N[C@@H](CCCCN)C(=O)N[C@@H](CO)C(=O)N[C@@H]([C@@H](C)O)C(=O)NCC(=O)NCC(=O)N[C@@H](CCCCN)C(=O)N[C@@H](C)C(=O)N1CCC[C@H]1C(=O)N[C@@H](CCCNC(N)=N)C(=O)N[C@@H](CCCCNC(=O)CO)C(=O)N[C@@H](CCC(N)=O)C(=O)N[C@@H](CC(C)C)C(N)=O