Reaction Details
TargetCarbonic anhydrase 2
LigandBDBM50240172
Substrate/Competitorn/a
Meas. Tech.ChEMBL_1667774 (CHEMBL4017662)
Ki 57500±n/a nM
Citation Entezari Heravi, YBua, SNocentini, ADel Prete, SSaboury, AASereshti, HCapasso, CGratteri, PSupuran, CT Inhibition of Malassezia globosa carbonic anhydrase with phenols. Bioorg Med Chem25:2577-2582 (2017) 
 
Carbonic anhydrase 2
Name:Carbonic anhydrase 2
Type:Enzyme
Mol. Mass.:29250.71
Organism:Homo sapiens (Human)
Description:P00918
Residue:260
BDBM50240172
NameBDBM50240172
Synonyms:CHEMBL4079998
TypeSmall organic molecule
Emp. Form.C6H6ClNO
Mol. Mass.143.571
SMILESNc1ccc(O)c(Cl)c1