Reaction Details
TargetCarbonic anhydrase 1
LigandBDBM50240172
Substrate/Competitorn/a
Meas. Tech.ChEMBL_1667773 (CHEMBL4017661)
Ki 57800±n/a nM
Citation Entezari Heravi, YBua, SNocentini, ADel Prete, SSaboury, AASereshti, HCapasso, CGratteri, PSupuran, CT Inhibition of Malassezia globosa carbonic anhydrase with phenols. Bioorg Med Chem25:2577-2582 (2017) 
 
Carbonic anhydrase 1
Name:Carbonic anhydrase 1
Type:Enzyme
Mol. Mass.:28873.37
Organism:Homo sapiens (Human)
Description:P00915
Residue:261
BDBM50240172
NameBDBM50240172
Synonyms:CHEMBL4079998
TypeSmall organic molecule
Emp. Form.C6H6ClNO
Mol. Mass.143.571
SMILESNc1ccc(O)c(Cl)c1