Reaction Details
TargetCarbonic anhydrase 12
LigandBDBM50334354
Substrate/Competitorn/a
Meas. Tech.ChEMBL_1667780 (CHEMBL4017668)
Ki 4.5±n/a nM
Citation Carta, FVullo, DOsman, SMAlOthman, ZSupuran, CT Synthesis and carbonic anhydrase inhibition of a series of SLC-0111 analogs. Bioorg Med Chem25:2569-2576 (2017) 
 
Carbonic anhydrase 12
Name:Carbonic anhydrase 12
Type:Enzyme
Mol. Mass.:39456.00
Organism:Homo sapiens (Human)
Description:Catalytic domain of human cloned isozyme was used in the assay
Residue:354
BDBM50334354
NameBDBM50334354
Synonyms:4-(3-(4-fluorophenyl)ureido)benzenesulfonamide 4-{[(4-fluorophenyl)carbamoyl]amino}benzenesulfonamide | CHEMBL1615281
TypeSmall organic molecule
Emp. Form.C13H12FN3O3S
Mol. Mass.309.316
SMILESNS(=O)(=O)c1ccc(NC(=O)Nc2ccc(F)cc2)cc1